Reaction Details
TargetGlucoamylase 1
LigandBDBM50403869
Substrate/Competitorn/a
Meas. Tech.ChEBML_34392
Ki 44000±n/a nM
Citation Popowycz, FGerber-Lemaire, SDemange, RRodriguez-García, EAsenjo, ATRobina, IVogel, P Derivatives of (2R,3R,4S)-2-aminomethylpyrrolidine-3,4-diol are selective alpha-mannosidase inhibitors. Bioorg Med Chem Lett11:2489-93 (2001) Glucoamylase 1
Name:Glucoamylase 1
Type:PROTEIN
Mol. Mass.:65164.54
Organism:Rhizopus oryzae
Description:ChEMBL_34392
Residue:604
BDBM50403869
NameBDBM50403869
Synonyms:CHEMBL2115197
TypeSmall organic molecule
Emp. Form.C6H13NO2
Mol. Mass.131.1729
SMILESCC[C@H]1NC[C@H](O)[C@@H]1O