Reaction Details
TargetD(2) dopamine receptor
LigandBDBM84637
Substrate/Competitorn/a
Meas. Tech.ChEMBL_58637 (CHEMBL665386)
Ki 52±n/a nM
Citation Einsiedel, JHübner, HGmeiner, P Benzamide bioisosteres incorporating dihydroheteroazole substructures: EPC synthesis and SAR leading to a selective dopamine D4 receptor partial agonist (FAUC 179). Bioorg Med Chem Lett11:2533-6 (2001) D(2) dopamine receptor
Name:D(2) dopamine receptor
Type:Cell-surface receptors
Mol. Mass.:50647.10
Organism:Homo sapiens (Human)
Description:P14416
Residue:443
BDBM84637
NameBDBM84637
Synonyms:CAS_85760-74-3 NSC_54562 Quinpirole,(-) | US9359372, Quinpirole
TypeSmall organic molecule
Emp. Form.C13H21N3
Mol. Mass.219.3259
SMILESCCCN1CCC[C@@H]2Cc3[nH]ncc3C[C@@H]12