Reaction Details
TargetReverse transcriptase/RNaseH
LigandBDBM50096414
Substrate/Competitorn/a
Meas. Tech.ChEBML_195673
IC50 174±n/a nM
Citation Corbett, JWPan, SMarkwalder, JACordova, BCKlabe, RMGarber, SRodgers, JDErickson-Viitanen, SK 3,3a-Dihydropyrano[4,3,2-de]quinazolin-2(1H)-ones are potent non-nucleoside reverse transcriptase inhibitors. Bioorg Med Chem Lett11:211-4 (2001) Reverse transcriptase/RNaseH
Name:Reverse transcriptase/RNaseH
Type:PROTEIN
Mol. Mass.:65229.15
Organism:Human immunodeficiency virus 1
Description:ChEMBL_1473730
Residue:566
BDBM50096414
NameBDBM50096414
Synonyms:6-Chloro-5-hydroxy-4-phenylethynyl-4-trifluoromethyl-3,4-dihydro-1H-quinazolin-2-one | CHEMBL70077
TypeSmall organic molecule
Emp. Form.C17H10ClF3N2O2
Mol. Mass.366.722
SMILESOc1c(Cl)ccc2NC(=O)NC(C#Cc3ccccc3)(c12)C(F)(F)F