Reaction Details
TargetReverse transcriptase/RNaseH
LigandBDBM50096420
Substrate/Competitorn/a
Meas. Tech.ChEBML_195673
IC50 90±n/a nM
Citation Corbett, JWPan, SMarkwalder, JACordova, BCKlabe, RMGarber, SRodgers, JDErickson-Viitanen, SK 3,3a-Dihydropyrano[4,3,2-de]quinazolin-2(1H)-ones are potent non-nucleoside reverse transcriptase inhibitors. Bioorg Med Chem Lett11:211-4 (2001) Reverse transcriptase/RNaseH
Name:Reverse transcriptase/RNaseH
Type:PROTEIN
Mol. Mass.:65229.15
Organism:Human immunodeficiency virus 1
Description:ChEMBL_1473730
Residue:566
BDBM50096420
NameBDBM50096420
Synonyms:7-Chloro-5-cyclopropyl-3a-trifluoromethyl-3,3a-dihydro-1H-6-oxa-1,3-diaza-phenalen-2-one | CHEMBL303446
TypeSmall organic molecule
Emp. Form.C14H10ClF3N2O2
Mol. Mass.330.69
SMILESFC(F)(F)C12NC(=O)Nc3ccc(Cl)c(OC(=C1)C1CC1)c23