Reaction Details
TargetMu-type opioid receptor
LigandBDBM50105495
Substrate/Competitorn/a
Meas. Tech.ChEBML_145282
Ki 0.540000±n/a nM
Citation Neumeyer, JLGu, XHvan Vliet, LADeNunzio, NJRusovici, DECohen, DJNegus, SSMello, NKBidlack, JM Mixed kappa agonists and mu agonists/antagonists as potential pharmacotherapeutics for cocaine abuse: synthesis and opioid receptor binding affinity of N-substituted derivatives of morphinan. Bioorg Med Chem Lett11:2735-40 (2001) Mu-type opioid receptor
Name:Mu-type opioid receptor
Type:Enzyme Catalytic Domain
Mol. Mass.:11165.58
Organism:GUINEA PIG
Description:P97266
Residue:98
BDBM50105495
NameBDBM50105495
Synonyms:17-isobutyl-(1R,9R,10R)-17-azatetracyclo[7.5.3.01,10.02,7]heptadeca-2(7),3,5-trien-5-ol MCL-108
TypeSmall organic molecule
Emp. Form.C20H29NO
Mol. Mass.299.4504
SMILESCC(C)CN1CCC23CCCC[C@H]2[C@H]1Cc1cc(O)ccc31