Reaction Details
TargetAdenosine receptor A3
LigandBDBM50366768
Substrate/Competitorn/a
Meas. Tech.ChEBML_31691
Ki 7.4±n/a nM
Citation Macchia, MSalvetti, FBertini, SDi Bussolo, VGattuso, LGesi, MHamdan, MKlotz, KNLaragione, TLucacchini, AMinutolo, FNencetti, SPapi, CTuscano, DMartini, C 7-Nitrobenzofurazan (NBD) derivatives of 5'-N-ethylcarboxamidoadenosine (NECA) as new fluorescent probes for human A(3) adenosine receptors. Bioorg Med Chem Lett11:3023-6 (2001) Adenosine receptor A3
Name:Adenosine receptor A3
Type:G Protein-Coupled Receptor (GPCR)
Mol. Mass.:36197.32
Organism:Homo sapiens (Human)
Description:P0DMS8
Residue:318
BDBM50366768
NameBDBM50366768
Synonyms:CHEMBL611561
TypeSmall organic molecule
Emp. Form.C26H34N10O7
Mol. Mass.598.611
SMILESCCNC(=O)C1OC(C(O)C1O)n1cnc2c(NCCCCCCCCNc3ccc([N+]([O-])=O)c4[n-][o+]nc34)ncnc12