Reaction Details
TargetReverse transcriptase/RNaseH
LigandBDBM50096664
Substrate/Competitorn/a
Meas. Tech.ChEBML_140633
IC50 26±n/a nM
Citation Corbett, JWKresge, KJPan, SCordova, BCKlabe, RMRodgers, JDErickson-Viitanen, SK Trifluoromethyl-containing 3-alkoxymethyl- and 3-aryloxymethyl-2-pyridinones are potent inhibitors of HIV-1 non-nucleoside reverse transcriptase. Bioorg Med Chem Lett11:309-12 (2001) Reverse transcriptase/RNaseH
Name:Reverse transcriptase/RNaseH
Type:PROTEIN
Mol. Mass.:65229.15
Organism:Human immunodeficiency virus 1
Description:ChEMBL_1473730
Residue:566
BDBM50096664
NameBDBM50096664
Synonyms:3-[3-Cyclopropyl-1-(pyridin-3-ylmethoxy)-1-trifluoromethyl-prop-2-ynyl]-1H-pyridin-2-one | CHEMBL106997
TypeSmall organic molecule
Emp. Form.C18H15F3N2O2
Mol. Mass.348.3191
SMILESFC(F)(F)C(OCc1cccnc1)(C#CC1CC1)c1ccc[nH]c1=O