Reaction Details
TargetReverse transcriptase/RNaseH
LigandBDBM50096665
Substrate/Competitorn/a
Meas. Tech.ChEBML_140633
IC50 6093±n/a nM
Citation Corbett, JWKresge, KJPan, SCordova, BCKlabe, RMRodgers, JDErickson-Viitanen, SK Trifluoromethyl-containing 3-alkoxymethyl- and 3-aryloxymethyl-2-pyridinones are potent inhibitors of HIV-1 non-nucleoside reverse transcriptase. Bioorg Med Chem Lett11:309-12 (2001) Reverse transcriptase/RNaseH
Name:Reverse transcriptase/RNaseH
Type:PROTEIN
Mol. Mass.:65229.15
Organism:Human immunodeficiency virus 1
Description:ChEMBL_1473730
Residue:566
BDBM50096665
NameBDBM50096665
Synonyms:3-[1-(2-Chloro-6-fluoro-benzyloxy)-3-cyclopropyl-1-trifluoromethyl-prop-2-ynyl]-5-ethyl-6-methyl-1H-pyridin-2-one | CHEMBL104738
TypeSmall organic molecule
Emp. Form.C22H20ClF4NO2
Mol. Mass.441.846
SMILESCCc1cc(c(=O)[nH]c1C)C(OCc1c(F)cccc1Cl)(C#CC1CC1)C(F)(F)F