Reaction Details
TargetReverse transcriptase/RNaseH
LigandBDBM50097575
Substrate/Competitorn/a
Meas. Tech.ChEBML_195511
IC50 2450±n/a nM
Citation Markwalder, JAChrist, DDMutlib, ACordova, BCKlabe, RMSeitz, SP Synthesis and biological activities of potential metabolites of the non-nucleoside reverse transcriptase inhibitor efavirenz. Bioorg Med Chem Lett11:619-22 (2001) Reverse transcriptase/RNaseH
Name:Reverse transcriptase/RNaseH
Type:PROTEIN
Mol. Mass.:65229.15
Organism:Human immunodeficiency virus 1
Description:ChEMBL_1473730
Residue:566
BDBM50097575
NameBDBM50097575
Synonyms:6-Chloro-4-cyclopropylethynyl-7-hydroxy-4-trifluoromethyl-1,4-dihydro-benzo[d][1,3]oxazin-2-one | CHEMBL346356
TypeSmall organic molecule
Emp. Form.C14H9ClF3NO3
Mol. Mass.331.674
SMILESOc1cc2NC(=O)OC(C#CC3CC3)(c2cc1Cl)C(F)(F)F