Reaction Details
TargetReverse transcriptase/RNaseH
LigandBDBM50097576
Substrate/Competitorn/a
Meas. Tech.ChEBML_195511
IC50>12500±n/a nM
Citation Markwalder, JAChrist, DDMutlib, ACordova, BCKlabe, RMSeitz, SP Synthesis and biological activities of potential metabolites of the non-nucleoside reverse transcriptase inhibitor efavirenz. Bioorg Med Chem Lett11:619-22 (2001) Reverse transcriptase/RNaseH
Name:Reverse transcriptase/RNaseH
Type:PROTEIN
Mol. Mass.:65229.15
Organism:Human immunodeficiency virus 1
Description:ChEMBL_1473730
Residue:566
BDBM50097576
NameBDBM50097576
Synonyms:(S)-6-Chloro-4-cyclopropylethynyl-8-hydroxy-4-trifluoromethyl-1,4-dihydro-benzo[d][1,3]oxazin-2-one | CHEMBL348180
TypeSmall organic molecule
Emp. Form.C14H9ClF3NO3
Mol. Mass.331.674
SMILESOc1cc(Cl)cc2c1NC(=O)O[C@@]2(C#CC1CC1)C(F)(F)F