Reaction Details
TargetSodium-dependent dopamine transporter
LigandBDBM50097917
Substrate/Competitorn/a
Meas. Tech.ChEBML_61824
IC50 25±n/a nM
Citation Simoni, DRoberti, MRondanin, RBaruchello, RRossi, MInvidiata, FPMerighi, SVarani, KGessi, SBorea, PAMarino, SCavallini, SBianchi, CSiniscalchi, A Effects of two-carbon bridge region methoxylation of benztropine: discovery of novel chiral ligands for the dopamine transporter. Bioorg Med Chem Lett11:823-7 (2001) Sodium-dependent dopamine transporter
Name:Sodium-dependent dopamine transporter
Type:Multi-pass membrane protein
Mol. Mass.:68749.45
Organism:Rattus norvegicus (rat)
Description:P23977
Residue:619
BDBM50097917
NameBDBM50097917
Synonyms:(3R,6R)-3-[Bis-(4-fluoro-phenyl)-methoxy]-6-methoxy-8-methyl-8-aza-bicyclo[3.2.1]octane | CHEMBL424565
TypeSmall organic molecule
Emp. Form.C22H25F2NO2
Mol. Mass.373.4362
SMILESCO[C@@H]1CC2C[C@H](CC1N2C)OC(c1ccc(F)cc1)c1ccc(F)cc1