Reaction Details
TargetAndrogen receptor
LigandBDBM25428
Substrate/Competitorn/a
Meas. Tech.ChEBML_36425
Ki 26±n/a nM
Citation Van Dort, MEJung, YW Synthesis and structure-activity studies of side-chain derivatized arylhydantoins for investigation as androgen receptor radioligands. Bioorg Med Chem Lett11:1045-7 (2001) Androgen receptor
Name:Androgen receptor
Type:Enzyme
Mol. Mass.:98219.08
Organism:Rattus norvegicus (Rat)
Description:P15207
Residue:902
BDBM25428
NameBDBM25428
Synonyms:4-[3-(4-hydroxybutyl)-4,4-dimethyl-2,5-dioxoimidazolidin-1-yl]-2-(trifluoromethyl)benzonitrile RU-58841
TypeSmall organic molecule
Emp. Form.C17H18F3N3O3
Mol. Mass.369.3383
SMILESCC1(C)N(CCCCO)C(=O)N(C1=O)c1ccc(C#N)c(c1)C(F)(F)F