Reaction Details
TargetAndrogen receptor
LigandBDBM50098982
Substrate/Competitorn/a
Meas. Tech.ChEBML_36425
Ki 120±n/a nM
Citation Van Dort, MEJung, YW Synthesis and structure-activity studies of side-chain derivatized arylhydantoins for investigation as androgen receptor radioligands. Bioorg Med Chem Lett11:1045-7 (2001) Androgen receptor
Name:Androgen receptor
Type:Enzyme
Mol. Mass.:98219.08
Organism:Rattus norvegicus (Rat)
Description:P15207
Residue:902
BDBM50098982
NameBDBM50098982
Synonyms:4-[3-(2-Methoxy-ethyl)-4,4-dimethyl-2,5-dioxo-imidazolidin-1-yl]-2-trifluoromethyl-benzonitrile | CHEMBL432658
TypeSmall organic molecule
Emp. Form.C16H16F3N3O3
Mol. Mass.355.3117
SMILESCOCCN1C(=O)N(C(=O)C1(C)C)c1ccc(C#N)c(c1)C(F)(F)F