Reaction Details
TargetP-selectin
LigandBDBM50450369
Substrate/Competitorn/a
Meas. Tech.ChEBML_200025
IC50 5000000±n/a nM
Citation De Vleeschauwer, MVaillancourt, MGoudreau, NGuindon, YGravel, D Design and synthesis of a new sialyl Lewis X mimetic: how selective are the selectin receptors? Bioorg Med Chem Lett11:1109-12 (2001) P-selectin
Name:P-selectin
Type:PROTEIN
Mol. Mass.:90834.61
Organism:Homo sapiens (Human)
Description:ChEMBL_1438999
Residue:830
BDBM50450369
NameBDBM50450369
Synonyms:SIALYL LEWIS X Sialyl lewis-x sialyl LewisX
TypeSmall organic molecule
Emp. Form.C31H52N2O23
Mol. Mass.820.7442
SMILES[H][C@]1(O[C@@](C[C@H](O)[C@H]1NC(C)=O)(O[C@H]1[C@@H](O)[C@@H](CO)O[C@@H](O[C@H]([C@H](O)CO)[C@H](O[C@@H]2O[C@@H](C)[C@@H](O)[C@@H](O)[C@@H]2O)[C@@H](NC(C)=O)C=O)[C@@H]1O)C(O)=O)[C@H](O)[C@H](O)CO