Reaction Details
TargetD(3) dopamine receptor
LigandBDBM50112788
Substrate/Competitorn/a
Meas. Tech.ChEBML_62274
Ki 19±n/a nM
Citation Cha, MYChoi, BCKang, KHPae, ANChoi, KICho, YSKoh, HYLee, HYJung, DKong, JY Design and synthesis of a piperazinylalkylisoxazole library for subtype selective dopamine receptor ligands. Bioorg Med Chem Lett12:1327-30 (2002) D(3) dopamine receptor
Name:D(3) dopamine receptor
Type:n/a
Mol. Mass.:44243.43
Organism:Homo sapiens (Human)
Description:n/a
Residue:400
BDBM50112788
NameBDBM50112788
Synonyms:1-Benzhydryl-4-{4-[3-(3-nitro-phenyl)-isoxazol-5-yl]-butyl}-piperazine; hydrochloride | CHEMBL553810
TypeSmall organic molecule
Emp. Form.C30H32N4O3
Mol. Mass.496.6001
SMILES[O-][N+](=O)c1cccc(c1)-c1cc(CCCCN2CCN(CC2)C(c2ccccc2)c2ccccc2)[o+][n-]1