Reaction Details
TargetD(4) dopamine receptor
LigandBDBM50112794
Substrate/Competitorn/a
Meas. Tech.ChEBML_60687
Ki 117±n/a nM
Citation Cha, MYChoi, BCKang, KHPae, ANChoi, KICho, YSKoh, HYLee, HYJung, DKong, JY Design and synthesis of a piperazinylalkylisoxazole library for subtype selective dopamine receptor ligands. Bioorg Med Chem Lett12:1327-30 (2002) D(4) dopamine receptor
Name:D(4) dopamine receptor
Type:Enzyme
Mol. Mass.:48373.19
Organism:Homo sapiens (Human)
Description:P21917
Residue:419
BDBM50112794
NameBDBM50112794
Synonyms:1-Phenyl-4-[4-(3-thiophen-2-yl-isoxazol-5-yl)-butyl]-piperazine; hydrochloride | CHEMBL542324
TypeSmall organic molecule
Emp. Form.C21H25N3OS
Mol. Mass.367.508
SMILESC(CCc1cc(no1)-c1cccs1)CN1CCN(CC1)c1ccccc1