Reaction Details
TargetD(3) dopamine receptor
LigandBDBM50112799
Substrate/Competitorn/a
Meas. Tech.ChEBML_62274
Ki 15±n/a nM
Citation Cha, MYChoi, BCKang, KHPae, ANChoi, KICho, YSKoh, HYLee, HYJung, DKong, JY Design and synthesis of a piperazinylalkylisoxazole library for subtype selective dopamine receptor ligands. Bioorg Med Chem Lett12:1327-30 (2002) D(3) dopamine receptor
Name:D(3) dopamine receptor
Type:n/a
Mol. Mass.:44243.43
Organism:Homo sapiens (Human)
Description:n/a
Residue:400
BDBM50112799
NameBDBM50112799
Synonyms:1-(2-Methoxy-phenyl)-4-[4-(3-styryl-isoxazol-5-yl)-butyl]-piperazine; hydrochloride | CHEMBL539744
TypeSmall organic molecule
Emp. Form.C26H31N3O2
Mol. Mass.417.5432
SMILESCOc1ccccc1N1CCN(CCCCc2cc(\C=C\c3ccccc3)no2)CC1