Reaction Details
TargetD(3) dopamine receptor
LigandBDBM50112803
Substrate/Competitorn/a
Meas. Tech.ChEBML_62274
Ki 52±n/a nM
Citation Cha, MYChoi, BCKang, KHPae, ANChoi, KICho, YSKoh, HYLee, HYJung, DKong, JY Design and synthesis of a piperazinylalkylisoxazole library for subtype selective dopamine receptor ligands. Bioorg Med Chem Lett12:1327-30 (2002) D(3) dopamine receptor
Name:D(3) dopamine receptor
Type:n/a
Mol. Mass.:44243.43
Organism:Homo sapiens (Human)
Description:n/a
Residue:400
BDBM50112803
NameBDBM50112803
Synonyms:1-Benzhydryl-4-[4-(3-thiophen-2-yl-isoxazol-5-yl)-butyl]-piperazine; hydrochloride | CHEMBL543040
TypeSmall organic molecule
Emp. Form.C28H31N3OS
Mol. Mass.457.63
SMILESC(CCc1cc(no1)-c1cccs1)CN1CCN(CC1)C(c1ccccc1)c1ccccc1