Reaction Details
TargetcAMP-specific 3',5'-cyclic phosphodiesterase 4A
LigandBDBM50346088
Substrate/Competitorn/a
Meas. Tech.ChEMBL_155035 (CHEMBL765477)
IC50 38±n/a nM
Citation Guay, DHamel, PBlouin, MBrideau, CChan, CCChauret, NDucharme, YHuang, ZGirard, MJones, TRLaliberté, FMasson, PMcAuliffe, MPiechuta, HSilva, JYoung, RNGirard, Y Discovery of L-791,943: a potent, selective, non emetic and orally active phosphodiesterase-4 inhibitor. Bioorg Med Chem Lett12:1457-61 (2002) cAMP-specific 3',5'-cyclic phosphodiesterase 4A
Name:cAMP-specific 3',5'-cyclic phosphodiesterase 4A
Type:Enzyme
Mol. Mass.:98113.27
Organism:Homo sapiens (Human)
Description:P27815
Residue:886
BDBM50346088
NameBDBM50346088
Synonyms:(1r,4r)-4-cyano-4-(3-(cyclopentyloxy)-4-methoxyphenyl)cyclohexanecarboxylic acid 4-Cyano-4-(3-cyclopentyloxy-4-methoxy-phenyl)-cyclohexanecarboxylic acid 4-Cyano-4-(3-cyclopentyloxy-4-methoxy-phenyl)-cyclohexanecarboxylic acid methyl ester 6-(3,4-Dimethoxy-phenyl)-5-methyl-4,5-dihydro-2H-pyridazin-3-one CHEMBL511115 | SB-207499
TypeSmall organic molecule
Emp. Form.C20H25NO4
Mol. Mass.343.4168
SMILESCOc1ccc(cc1OC1CCCC1)[C@]1(CC[C@@H](CC1)C(O)=O)C#N