Reaction Details
TargetcAMP-specific 3',5'-cyclic phosphodiesterase 4A
LigandBDBM50064858
Substrate/Competitorn/a
Meas. Tech.ChEMBL_155035 (CHEMBL765477)
IC50 4.3±n/a nM
Citation Guay, DHamel, PBlouin, MBrideau, CChan, CCChauret, NDucharme, YHuang, ZGirard, MJones, TRLaliberté, FMasson, PMcAuliffe, MPiechuta, HSilva, JYoung, RNGirard, Y Discovery of L-791,943: a potent, selective, non emetic and orally active phosphodiesterase-4 inhibitor. Bioorg Med Chem Lett12:1457-61 (2002) cAMP-specific 3',5'-cyclic phosphodiesterase 4A
Name:cAMP-specific 3',5'-cyclic phosphodiesterase 4A
Type:Enzyme
Mol. Mass.:98113.27
Organism:Homo sapiens (Human)
Description:P27815
Residue:886
BDBM50064858
NameBDBM50064858
Synonyms:(R)-4-(2-(3-(cyclopentyloxy)-4-methoxyphenyl)-2-phenylethyl)pyridine 4-[2-(3-Cyclopentyloxy-4-methoxy-phenyl)-2-phenyl-ethyl]-pyridine | CHEMBL32442
TypeSmall organic molecule
Emp. Form.C25H27NO2
Mol. Mass.373.4874
SMILESCOc1ccc(cc1OC1CCCC1)[C@H](Cc1ccncc1)c1ccccc1