Reaction Details
Target5-hydroxytryptamine receptor 2A
LigandBDBM50115717
Substrate/Competitorn/a
Meas. Tech.ChEBML_2547
Ki 380±n/a nM
Citation Bergauer, MHübner, HGmeiner, P 2,4-Disubstituted pyrroles: synthesis, traceless linking and pharmacological investigations leading to the dopamine D4 receptor partial agonist FAUC 356. Bioorg Med Chem Lett12:1937-40 (2002) 5-hydroxytryptamine receptor 2A
Name:5-hydroxytryptamine receptor 2A
Type:Enzyme Catalytic Domain
Mol. Mass.:52679.13
Organism:PIG
Description:5-HT2 0 0::P50129
Residue:470
BDBM50115717
NameBDBM50115717
Synonyms:1-(4-Ethynyl-1H-pyrrol-2-ylmethyl)-4-phenyl-piperazine | CHEMBL57176
TypeSmall organic molecule
Emp. Form.C17H19N3
Mol. Mass.265.3529
SMILESC#Cc1c[nH]c(CN2CCN(CC2)c2ccccc2)c1