Reaction Details
Target5-hydroxytryptamine receptor 2A
LigandBDBM50115715
Substrate/Competitorn/a
Meas. Tech.ChEBML_2547
Ki 610±n/a nM
Citation Bergauer, MHübner, HGmeiner, P 2,4-Disubstituted pyrroles: synthesis, traceless linking and pharmacological investigations leading to the dopamine D4 receptor partial agonist FAUC 356. Bioorg Med Chem Lett12:1937-40 (2002) 5-hydroxytryptamine receptor 2A
Name:5-hydroxytryptamine receptor 2A
Type:Enzyme Catalytic Domain
Mol. Mass.:52679.13
Organism:PIG
Description:5-HT2 0 0::P50129
Residue:470
BDBM50115715
NameBDBM50115715
Synonyms:5-(4-Phenyl-piperazin-1-ylmethyl)-1H-pyrrole-3-carbonitrile | CHEMBL56118
TypeSmall organic molecule
Emp. Form.C16H18N4
Mol. Mass.266.3409
SMILESN#Cc1c[nH]c(CN2CCN(CC2)c2ccccc2)c1