Reaction Details
TargetIsoform 4 of Membrane-associated guanylate kinase, WW and PDZ domain-containing protein 3 (4)
LigandBDBM50366792
Substrate/Competitorn/a
Meas. Tech.ChEBML_99589
IC50 9800±n/a nM
Citation Novak, KAFujii, NGuy, RK Investigation of the PDZ domain ligand binding site using chemically modified peptides. Bioorg Med Chem Lett12:2471-4 (2002) Isoform 4 of Membrane-associated guanylate kinase, WW and PDZ domain-containing protein 3 (4)
Name:Isoform 4 of Membrane-associated guanylate kinase, WW and PDZ domain-containing protein 3 (4)
Type:PROTEIN
Mol. Mass.:165630.05
Organism:Homo sapiens (Human)
Description:ChEMBL_99591
Residue:1506
BDBM50366792
NameBDBM50366792
Synonyms:CHEMBL1790641
TypeSmall organic molecule
Emp. Form.C38H58N8O11
Mol. Mass.802.9141
SMILESCC[C@H](C)[C@H](NC(=O)[C@H](CCC(N)=O)N(C)C(=O)[C@@H](NC(C)=O)[C@H](C)O)C(=O)N[C@@H]([C@H](C)O)C(=O)N[C@@H](Cc1c[nH]c2ccccc12)C(=O)N[C@@H](C(C)C)C(O)=O