Reaction Details
TargetD(2) dopamine receptor
LigandBDBM50108390
Substrate/Competitorn/a
Meas. Tech.ChEMBL_62248 (CHEMBL675475)
Ki 842±n/a nM
Citation Iriepa, IVillasante, FJGálvez, ELabeaga, LInnerarity, AOrjales, A Synthesis and pharmacology of isoquinuclidine derivatives as 5-HT(3) ligands. Bioorg Med Chem Lett12:189-92 (2001) D(2) dopamine receptor
Name:D(2) dopamine receptor
Type:G Protein-Coupled Receptor (GPCR)
Mol. Mass.:50931.60
Organism:Rattus norvegicus (rat)
Description:P61169
Residue:444
BDBM50108390
NameBDBM50108390
Synonyms:4-Amino-5-chloro-2-methoxy-N-(2-methyl-2-aza-bicyclo[2.2.2]oct-5-yl)-benzamide | CHEMBL56994
TypeSmall organic molecule
Emp. Form.C16H22ClN3O2
Mol. Mass.323.818
SMILESCOc1cc(N)c(Cl)cc1C(=O)NC1CC2CCC1CN2C