Reaction Details
TargetDipeptidyl peptidase 2
LigandBDBM50118931
Substrate/Competitorn/a
Meas. Tech.ChEBML_53193
IC50>1000000±n/a nM
Citation Senten, KVan der Veken, PBal, GDe Meester, ILambeir, AMScharpé, SBauvois, BHaemers, AAugustyns, K Development of potent and selective dipeptidyl peptidase II inhibitors. Bioorg Med Chem Lett12:2825-8 (2002) Dipeptidyl peptidase 2
Name:Dipeptidyl peptidase 2
Type:Protein
Mol. Mass.:54339.29
Organism:Homo sapiens (Human)
Description:Q9UHL4
Residue:492
BDBM50118931
NameBDBM50118931
Synonyms:2-Amino-1-pyrrolidin-1-yl-ethanone CHEMBL97025
TypeSmall organic molecule
Emp. Form.C6H12N2O
Mol. Mass.128.1723
SMILESNCC(=O)N1CCCC1