Reaction Details
TargetEpidermal growth factor receptor
LigandBDBM50119074
Substrate/Competitorn/a
Meas. Tech.ChEBML_66581
IC50 80±n/a nM
Citation Wissner, ABrawner Floyd, MBRabindran, SKNilakantan, RGreenberger, LMShen, RWang, YFTsou, HR Syntheses and EGFR and HER-2 kinase inhibitory activities of 4-anilinoquinoline-3-carbonitriles: analogues of three important 4-anilinoquinazolines currently undergoing clinical evaluation as therapeutic antitumor agents. Bioorg Med Chem Lett12:2893-7 (2002) Epidermal growth factor receptor
Name:Epidermal growth factor receptor
Type:Receptor Kinase Domain
Mol. Mass.:134279.59
Organism:Homo sapiens (Human)
Description:P00533
Residue:1210
BDBM50119074
NameBDBM50119074
Synonyms:CHEMBL95774 | N-[4-(3-Chloro-4-fluoro-phenylamino)-3-cyano-7-(3-morpholin-4-yl-propoxy)-quinolin-6-yl]-acrylamide
TypeSmall organic molecule
Emp. Form.C26H25ClFN5O3
Mol. Mass.509.96
SMILESFc1ccc(Nc2c(cnc3cc(OCCCN4CCOCC4)c(NC(=O)C=C)cc23)C#N)cc1Cl