Reaction Details
TargetNeuronal acetylcholine receptor subunit alpha-7
LigandBDBM50366779
Substrate/Competitorn/a
Meas. Tech.ChEBML_144178
Ki 2.3±n/a nM
Citation Ayers, JTDwoskin, LPDeaciuc, AGGrinevich, VPZhu, JCrooks, PA bis-Azaaromatic quaternary ammonium analogues: ligands for alpha4beta2* and alpha7* subtypes of neuronal nicotinic receptors. Bioorg Med Chem Lett12:3067-71 (2002) Neuronal acetylcholine receptor subunit alpha-7
Name:Neuronal acetylcholine receptor subunit alpha-7
Type:Enzyme
Mol. Mass.:56502.44
Organism:Rattus norvegicus (Rat)
Description:Q05941
Residue:502
BDBM50366779
NameBDBM50366779
Synonyms:METHYLLYCACONITINE
TypeSmall organic molecule
Emp. Form.C37H50N2O10
Mol. Mass.682.8003
SMILESCCN1C[C@]2(COC(=O)c3ccccc3-n3c(O)cc(C)c3O)CC[C@H](OC)[C@@]34[C@@H]5C[C@H]6[C@H](OC)[C@@H]5[C@](O)(C[C@@H]6OC)[C@](O)([C@@H](OC)[C@H]23)[C@H]14