Reaction Details
TargetD(4) dopamine receptor
LigandBDBM85093
Substrate/Competitorn/a
Meas. Tech.ChEMBL_60674 (CHEMBL674045)
Ki 0.620000±n/a nM
Citation Löber, SAboul-Fadl, THübner, HGmeiner, P Di- and trisubstituted pyrazolo[1,5-a]pyridine derivatives: synthesis, dopamine receptor binding and ligand efficacy. Bioorg Med Chem Lett12:633-6 (2002) D(4) dopamine receptor
Name:D(4) dopamine receptor
Type:Enzyme
Mol. Mass.:48373.19
Organism:Homo sapiens (Human)
Description:P21917
Residue:419
BDBM85093
NameBDBM85093
Synonyms:CAS_3853 CHEMBL555670 NSC_3853
TypeSmall organic molecule
Emp. Form.C18H19ClN4
Mol. Mass.326.823
SMILESClc1ccc(cc1)N1CCN(Cc2c[nH]c3ncccc23)CC1