Reaction Details
TargetProthrombin
LigandBDBM50110376
Substrate/Competitorn/a
Meas. Tech.ChEBML_208524
Ki 167±n/a nM
Citation Ho, JZGibson, TSSemple, JE Novel, potent non-covalent thrombin inhibitors incorporating p(3)-lactam scaffolds. Bioorg Med Chem Lett12:743-8 (2002) Prothrombin
Name:Prothrombin
Type:Protein
Mol. Mass.:70029.57
Organism:Homo sapiens (Human)
Description:P00734
Residue:622
BDBM50110376
NameBDBM50110376
Synonyms:4-{3-[(S)-3-(2,5-Dimethoxy-benzenesulfonylamino)-2-oxo-azepan-1-yl]-2-oxo-propyl}-piperidine-1-carboxamidine | CHEMBL351306
TypeSmall organic molecule
Emp. Form.C23H35N5O6S
Mol. Mass.509.619
SMILESCOc1ccc(OC)c(c1)S(=O)(=O)N[C@H]1CCCCN(CC(=O)CC2CCN(CC2)C(N)=N)C1=O