Reaction Details
TargetProthrombin
LigandBDBM50110381
Substrate/Competitorn/a
Meas. Tech.ChEBML_208524
Ki 40±n/a nM
Citation Ho, JZGibson, TSSemple, JE Novel, potent non-covalent thrombin inhibitors incorporating p(3)-lactam scaffolds. Bioorg Med Chem Lett12:743-8 (2002) Prothrombin
Name:Prothrombin
Type:Protein
Mol. Mass.:70029.57
Organism:Homo sapiens (Human)
Description:P00734
Residue:622
BDBM50110381
NameBDBM50110381
Synonyms:2,3-Dihydro-benzofuran-5-sulfonic acid {(S)-1-[3-(6-amino-2-methyl-pyridin-3-yl)-2-oxo-propyl]-2-oxo-azepan-3-yl}-amide | CHEMBL424172
TypeSmall organic molecule
Emp. Form.C23H28N4O5S
Mol. Mass.472.557
SMILESCc1nc(N)ccc1CC(=O)CN1CCCC[C@H](NS(=O)(=O)c2ccc3OCCc3c2)C1=O