Reaction Details
TargetProthrombin
LigandBDBM50110375
Substrate/Competitorn/a
Meas. Tech.ChEBML_208524
Ki 164±n/a nM
Citation Ho, JZGibson, TSSemple, JE Novel, potent non-covalent thrombin inhibitors incorporating p(3)-lactam scaffolds. Bioorg Med Chem Lett12:743-8 (2002) Prothrombin
Name:Prothrombin
Type:Protein
Mol. Mass.:70029.57
Organism:Homo sapiens (Human)
Description:P00734
Residue:622
BDBM50110375
NameBDBM50110375
Synonyms:4-{3-[(S)-3-(Naphthalene-2-sulfonylamino)-2-oxo-azepan-1-yl]-2-oxo-propyl}-benzamidine | CHEMBL355378
TypeSmall organic molecule
Emp. Form.C26H28N4O4S
Mol. Mass.492.59
SMILESNC(=N)c1ccc(CC(=O)CN2CCCC[C@H](NS(=O)(=O)c3ccc4ccccc4c3)C2=O)cc1