Reaction Details
TargetProthrombin
LigandBDBM50110390
Substrate/Competitorn/a
Meas. Tech.ChEBML_208524
Ki 195±n/a nM
Citation Ho, JZGibson, TSSemple, JE Novel, potent non-covalent thrombin inhibitors incorporating p(3)-lactam scaffolds. Bioorg Med Chem Lett12:743-8 (2002) Prothrombin
Name:Prothrombin
Type:Protein
Mol. Mass.:70029.57
Organism:Homo sapiens (Human)
Description:P00734
Residue:622
BDBM50110390
NameBDBM50110390
Synonyms:CHEMBL350117 | N-{(S)-1-[3-(4-Amino-cyclohexyl)-2-oxo-propyl]-2-oxo-azepan-3-yl}-C-phenyl-methanesulfonamide
TypeSmall organic molecule
Emp. Form.C22H33N3O4S
Mol. Mass.435.58
SMILESN[C@H]1CC[C@H](CC(=O)CN2CCCC[C@H](NS(=O)(=O)Cc3ccccc3)C2=O)CC1