Reaction Details
TargetProthrombin
LigandBDBM50110394
Substrate/Competitorn/a
Meas. Tech.ChEBML_208524
Ki 0.950000±n/a nM
Citation Ho, JZGibson, TSSemple, JE Novel, potent non-covalent thrombin inhibitors incorporating p(3)-lactam scaffolds. Bioorg Med Chem Lett12:743-8 (2002) Prothrombin
Name:Prothrombin
Type:Protein
Mol. Mass.:70029.57
Organism:Homo sapiens (Human)
Description:P00734
Residue:622
BDBM50110394
NameBDBM50110394
Synonyms:P1 argininal derivative | [amino({[(4S)-4-carboxy-4-{2-[(3S)-3-({[2-(methoxycarbonyl)phenyl]methane}sulfonamido)-2-oxoazepan-1-yl]acetamido}butyl]amino})methylidene]azanium
TypeSmall organic molecule
Emp. Form.C23H35N6O8S
Mol. Mass.555.624
SMILESCOC(=O)c1ccccc1CS(=O)(=O)N[C@H]1CCCCN(CC(=O)N[C@@H](CCCNC(N)=[NH2+])C(O)=O)C1=O