Reaction Details
TargetProthrombin
LigandBDBM50110396
Substrate/Competitorn/a
Meas. Tech.ChEBML_208524
Ki 61±n/a nM
Citation Ho, JZGibson, TSSemple, JE Novel, potent non-covalent thrombin inhibitors incorporating p(3)-lactam scaffolds. Bioorg Med Chem Lett12:743-8 (2002) Prothrombin
Name:Prothrombin
Type:Protein
Mol. Mass.:70029.57
Organism:Homo sapiens (Human)
Description:P00734
Residue:622
BDBM50110396
NameBDBM50110396
Synonyms:4-{3-[(S)-3-(2,3-Dihydro-benzofuran-5-sulfonylamino)-2-oxo-2,3,4,5-tetrahydro-benzo[b]azepin-1-yl]-2-oxo-propyl}-piperidine-1-carboxamidine | CHEMBL436430
TypeSmall organic molecule
Emp. Form.C27H33N5O5S
Mol. Mass.539.646
SMILESNC(=N)N1CCC(CC(=O)CN2c3ccccc3CC[C@H](NS(=O)(=O)c3ccc4OCCc4c3)C2=O)CC1