Reaction Details
TargetProthrombin
LigandBDBM50111118
Substrate/Competitorn/a
Meas. Tech.ChEBML_208337
Ki 0.100000±n/a nM
Citation Lee, KJung, WHPark, CWPark, HDLee, SHKwon, OH Noncovalent tripeptidic thrombin inhibitors incorporating amidrazone, amine and amidine functions at P1. Bioorg Med Chem Lett12:1017-22 (2002) Prothrombin
Name:Prothrombin
Type:Protein
Mol. Mass.:70029.57
Organism:Homo sapiens (Human)
Description:P00734
Residue:622
BDBM50111118
NameBDBM50111118
Synonyms:2N-(4-Benzamidinemethyl)-1-[2-Hydroxysulfonamido-3,3-diphenyl-(2R)-propanoyl]-(2S)-tetrahydro-1H-2-pyrrolecarboxamide;TFA
TypeSmall organic molecule
Emp. Form.C28H31N5O5S
Mol. Mass.549.641
SMILESNC(=N)c1ccc(CNC(=O)[C@@H]2CCCN2C(=O)[C@H](NS(O)(=O)=O)C(c2ccccc2)c2ccccc2)cc1