Reaction Details
TargetEndothelin-converting enzyme 1
LigandBDBM50112401
Substrate/Competitorn/a
Meas. Tech.ChEBML_64349
IC50 3400±n/a nM
Citation Yamazaki, KHasegawa, HUmekawa, KUeki, YOhashi, NKanaoka, M Design, synthesis and biological activity of novel non-peptidyl endothelin converting enzyme inhibitors, 1-phenyl-tetrazole-formazan analogues. Bioorg Med Chem Lett12:1275-8 (2002) Endothelin-converting enzyme 1
Name:Endothelin-converting enzyme 1
Type:Protein
Mol. Mass.:86126.89
Organism:Rattus norvegicus (Rat)
Description:P42893
Residue:762
BDBM50112401
NameBDBM50112401
Synonyms:5-{(2Z)-2-[[(E)-(4-isopropylphenyl)diazenyl](phenyl)methylene]hydrazino}-1-phenyl-1H-tetrazole | CHEMBL23279
TypeSmall organic molecule
Emp. Form.C23H22N8
Mol. Mass.410.4744
SMILESCC(C)c1ccc(NN=C(N=Nc2nnnn2-c2ccccc2)c2ccccc2)cc1