Reaction Details
TargetCytochrome P450 1B1
LigandBDBM50131044
Substrate/Competitorn/a
Meas. Tech.ChEBML_51378
IC50 69±n/a nM
Citation Don, MJLewis, DFWang, SYTsai, MWUeng, YF Effect of structural modification on the inhibitory selectivity of rutaecarpine derivatives on human CYP1A1, CYP1A2, and CYP1B1. Bioorg Med Chem Lett13:2535-8 (2003) Cytochrome P450 1B1
Name:Cytochrome P450 1B1
Type:PROTEIN
Mol. Mass.:60861.81
Organism:Homo sapiens (Human)
Description:ChEMBL_1474523
Residue:543
BDBM50131044
NameBDBM50131044
Synonyms:13H-Indolo[2',3':3,4]pyrido[2,1-b]quinazolin-5-one | CHEMBL413956
TypeSmall organic molecule
Emp. Form.C18H11N3O
Mol. Mass.285.2994
SMILESO=c1c2ccccc2[nH]c2c3nc4ccccc4c3ccn12