Reaction Details
TargetPotassium voltage-gated channel subfamily H member 2
LigandBDBM50117924
Substrate/Competitorn/a
Meas. Tech.ChEMBL_158540 (CHEMBL766814)
IC50 50119±n/a nM
Citation Keserü, GM Prediction of hERG potassium channel affinity by traditional and hologram qSAR methods. Bioorg Med Chem Lett13:2773-5 (2003) Potassium voltage-gated channel subfamily H member 2
Name:Potassium voltage-gated channel subfamily H member 2
Type:Multi-pass membrane protein
Mol. Mass.:126672.65
Organism:Homo sapiens (Human)
Description:Q12809
Residue:1159
BDBM50117924
NameBDBM50117924
Synonyms:1-Cyclopropyl-6-fluoro-5-methyl-7-(3-methyl-piperazin-1-yl)-4-oxo-1,4,4a,8a-tetrahydro-quinoline-3-carboxylic acid (Grepafloxacin) 1-cyclopropyl-6-fluoro-5-methyl-7-(3-methylpiperazin-1-yl)-4-oxo-1,4-dihydroquinoline-3-carboxylic acid GREPAFLOXACIN | Raxar
TypeSmall organic molecule
Emp. Form.C19H22FN3O3
Mol. Mass.359.3947
SMILESCC1CN(CCN1)c1cc2n(cc(C(O)=O)c(=O)c2c(C)c1F)C1CC1