Reaction Details
TargetThymidylate kinase
LigandBDBM1
Substrate/Competitorn/a
Meas. Tech.ChEBML_208218
Ki 27000±n/a nM
Citation Vanheusden, VVan Rompaey, PMunier-Lehmann, HPochet, SHerdewijn, PVan Calenbergh, S Thymidine and thymidine-5'-O-monophosphate analogues as inhibitors of Mycobacterium tuberculosis thymidylate kinase. Bioorg Med Chem Lett13:3045-8 (2003) Thymidylate kinase
Name:Thymidylate kinase
Type:PROTEIN
Mol. Mass.:22636.29
Organism:Mycobacterium tuberculosis
Description:ChEMBL_208218
Residue:214
BDBM1
NameBDBM1
Synonyms:dT | thymidine
TypeNucleoside or nucleotide
Emp. Form.C10H14N2O5
Mol. Mass.242.2286
SMILESCc1cn([C@H]2C[C@H](O)[C@@H](CO)O2)c(=O)[nH]c1=O