Reaction Details
TargetThymidylate kinase
LigandBDBM50366828
Substrate/Competitorn/a
Meas. Tech.ChEMBL_208219 (CHEMBL816310)
Ki 30000±n/a nM
Citation Vanheusden, VVan Rompaey, PMunier-Lehmann, HPochet, SHerdewijn, PVan Calenbergh, S Thymidine and thymidine-5'-O-monophosphate analogues as inhibitors of Mycobacterium tuberculosis thymidylate kinase. Bioorg Med Chem Lett13:3045-8 (2003) Thymidylate kinase
Name:Thymidylate kinase
Type:PROTEIN
Mol. Mass.:22636.29
Organism:Mycobacterium tuberculosis
Description:ChEMBL_208218
Residue:214
BDBM50366828
NameBDBM50366828
Synonyms:CHEMBL1236157
TypeSmall organic molecule
Emp. Form.C20H30N7O23P5
Mol. Mass.891.3541
SMILESCc1cn([C@H]2C[C@H](O)[C@@H](COP(O)(=O)OP(O)(=O)OP(O)(=O)OP(O)(=O)OP(O)(=O)OC[C@H]3O[C@H]([C@H](O)[C@@H]3O)n3cnc4c(N)ncnc34)O2)c(=O)[nH]c1=O