Reaction Details
TargetThymidylate kinase
LigandBDBM50118628
Substrate/Competitorn/a
Meas. Tech.ChEBML_208218
Ki 10000±n/a nM
Citation Vanheusden, VVan Rompaey, PMunier-Lehmann, HPochet, SHerdewijn, PVan Calenbergh, S Thymidine and thymidine-5'-O-monophosphate analogues as inhibitors of Mycobacterium tuberculosis thymidylate kinase. Bioorg Med Chem Lett13:3045-8 (2003) Thymidylate kinase
Name:Thymidylate kinase
Type:PROTEIN
Mol. Mass.:22636.29
Organism:Mycobacterium tuberculosis
Description:ChEMBL_208218
Residue:214
BDBM50118628
NameBDBM50118628
Synonyms:(R)-1-((R)-4-Azido-5-methylphosphate-tetrahydro-furan-2-yl)-5-methyl-1H-pyrimidine-2,4-dione | Phosphoric acid mono-[3-azido-5-(5-methyl-2,4-dioxo-3,4-dihydro-2H-pyrimidin-1-yl)-tetrahydro-furan-2-ylmethyl] ester
TypeSmall organic molecule
Emp. Form.C10H12N5O7P
Mol. Mass.345.2064
SMILESCc1cn([C@H]2C[C@H](N=[N+]=[N-])[C@@H](COP([O-])([O-])=O)O2)c(=O)[nH]c1=O