Reaction Details
TargetThymidylate kinase
LigandBDBM50132296
Substrate/Competitorn/a
Meas. Tech.ChEBML_208218
Ki 5000±n/a nM
Citation Vanheusden, VVan Rompaey, PMunier-Lehmann, HPochet, SHerdewijn, PVan Calenbergh, S Thymidine and thymidine-5'-O-monophosphate analogues as inhibitors of Mycobacterium tuberculosis thymidylate kinase. Bioorg Med Chem Lett13:3045-8 (2003) Thymidylate kinase
Name:Thymidylate kinase
Type:PROTEIN
Mol. Mass.:22636.29
Organism:Mycobacterium tuberculosis
Description:ChEMBL_208218
Residue:214
BDBM50132296
NameBDBM50132296
Synonyms:5-Bromo-1-((2R,5R)-5-methyl-tetrahydro-furan-2-yl)-1H-pyrimidine-2,4-dione | CHEMBL102454
TypeSmall organic molecule
Emp. Form.C9H11BrN2O3
Mol. Mass.275.099
SMILESC[C@@H]1CC[C@@H](O1)n1cc(Br)c(=O)[nH]c1=O