Reaction Details
TargetThymidylate kinase
LigandBDBM50132301
Substrate/Competitorn/a
Meas. Tech.ChEBML_208218
Ki 1900000±n/a nM
Citation Vanheusden, VVan Rompaey, PMunier-Lehmann, HPochet, SHerdewijn, PVan Calenbergh, S Thymidine and thymidine-5'-O-monophosphate analogues as inhibitors of Mycobacterium tuberculosis thymidylate kinase. Bioorg Med Chem Lett13:3045-8 (2003) Thymidylate kinase
Name:Thymidylate kinase
Type:PROTEIN
Mol. Mass.:22636.29
Organism:Mycobacterium tuberculosis
Description:ChEMBL_208218
Residue:214
BDBM50132301
NameBDBM50132301
Synonyms:1-((2R,5R)-4-Amino-3-hydroxy-5-methyl-tetrahydro-furan-2-yl)-5-methyl-1H-pyrimidine-2,4-dione | CHEMBL102768
TypeSmall organic molecule
Emp. Form.C10H15N3O4
Mol. Mass.241.2438
SMILESC[C@H]1O[C@H]([C@H](O)[C@@H]1N)n1cc(C)c(=O)[nH]c1=O