Reaction Details
TargetBeta-galactoside alpha-2,6-sialyltransferase 1
LigandBDBM50366834
Substrate/Competitorn/a
Meas. Tech.ChEMBL_216152 (CHEMBL817949)
Ki 3800000±n/a nM
Citation Whalen, LJMcEvoy, KAHalcomb, RL Synthesis and evaluation of phosphoramidate amino acid-based inhibitors of sialyltransferases. Bioorg Med Chem Lett13:301-4 (2002) Beta-galactoside alpha-2,6-sialyltransferase 1
Name:Beta-galactoside alpha-2,6-sialyltransferase 1
Type:PROTEIN
Mol. Mass.:46743.36
Organism:Rattus norvegicus
Description:ChEMBL_216152
Residue:403
BDBM50366834
NameBDBM50366834
Synonyms:CHEMBL609800
TypeSmall organic molecule
Emp. Form.C18H23N4O9P
Mol. Mass.470.3704
SMILESNc1ccn(C2O[C@H](COP(O)(=O)N[C@@H](Cc3ccccc3)C(O)=O)[C@@H](O)[C@H]2O)c(=O)n1