Reaction Details
TargetBeta-galactoside alpha-2,6-sialyltransferase 1
LigandBDBM50366835
Substrate/Competitorn/a
Meas. Tech.ChEMBL_216152 (CHEMBL817949)
Ki 2200000±n/a nM
Citation Whalen, LJMcEvoy, KAHalcomb, RL Synthesis and evaluation of phosphoramidate amino acid-based inhibitors of sialyltransferases. Bioorg Med Chem Lett13:301-4 (2002) Beta-galactoside alpha-2,6-sialyltransferase 1
Name:Beta-galactoside alpha-2,6-sialyltransferase 1
Type:PROTEIN
Mol. Mass.:46743.36
Organism:Rattus norvegicus
Description:ChEMBL_216152
Residue:403
BDBM50366835
NameBDBM50366835
Synonyms:CHEMBL609514
TypeSmall organic molecule
Emp. Form.C13H19N4O11P
Mol. Mass.438.2839
SMILESNc1ccn(C2O[C@H](COP(O)(=O)N[C@@H](CC(O)=O)C(O)=O)[C@@H](O)[C@H]2O)c(=O)n1