Reaction Details
TargetSphingosine 1-phosphate receptor 1
LigandBDBM50158348
Substrate/Competitorn/a
Meas. Tech.ChEMBL_201313 (CHEMBL800920)
EC50 4.5±n/a nM
Citation Clemens, JJDavis, MDLynch, KRMacdonald, TL Synthesis of para-alkyl aryl amide analogues of sphingosine-1-phosphate: discovery of potent S1P receptor agonists. Bioorg Med Chem Lett13:3401-4 (2003) Sphingosine 1-phosphate receptor 1
Name:Sphingosine 1-phosphate receptor 1
Type:Enzyme
Mol. Mass.:42836.02
Organism:Homo sapiens (Human)
Description:P21453
Residue:382
BDBM50158348
NameBDBM50158348
Synonyms:(2S,3R,4E)-2-amino-3-hydroxyoctadec-4-en-1-yl dihydrogen phosphate CHEMBL225155 US11584726, Example S1P sphingosine-1-phosphate
TypeSmall organic molecule
Emp. Form.C18H38NO5P
Mol. Mass.379.4718
SMILESCCCCCCCCCCCCC\C=C\[C@@H](O)[C@@H](N)COP(O)(O)=O