Reaction Details
TargetSphingosine 1-phosphate receptor 5
LigandBDBM50133424
Substrate/Competitorn/a
Meas. Tech.ChEMBL_201455 (CHEMBL807600)
EC50 160±n/a nM
Citation Clemens, JJDavis, MDLynch, KRMacdonald, TL Synthesis of para-alkyl aryl amide analogues of sphingosine-1-phosphate: discovery of potent S1P receptor agonists. Bioorg Med Chem Lett13:3401-4 (2003) Sphingosine 1-phosphate receptor 5
Name:Sphingosine 1-phosphate receptor 5
Type:G Protein-Coupled Receptor (GPCR)
Mol. Mass.:41796.42
Organism:Homo sapiens (Human)
Description:n/a
Residue:398
BDBM50133424
NameBDBM50133424
Synonyms:CHEMBL116953 | Phosphoric acid mono-[(R)-2-amino-2-(4-dodecyl-phenylcarbamoyl)-ethyl] ester; TFA
TypeSmall organic molecule
Emp. Form.C21H37N2O5P
Mol. Mass.428.5026
SMILESCCCCCCCCCCCCc1ccc(NC(=O)[C@H](N)COP(O)(O)=O)cc1