Reaction Details
TargetSphingosine 1-phosphate receptor 2
LigandBDBM50133428
Substrate/Competitorn/a
Meas. Tech.ChEMBL_201318 (CHEMBL806168)
EC50>5000±n/a nM
Citation Clemens, JJDavis, MDLynch, KRMacdonald, TL Synthesis of para-alkyl aryl amide analogues of sphingosine-1-phosphate: discovery of potent S1P receptor agonists. Bioorg Med Chem Lett13:3401-4 (2003) Sphingosine 1-phosphate receptor 2
Name:Sphingosine 1-phosphate receptor 2
Type:G Protein-Coupled Receptor (GPCR)
Mol. Mass.:38883.16
Organism:Homo sapiens (Human)
Description:Membranes isolated from S1P2-transfected CHO cells were used in ligand binding assay.
Residue:353
BDBM50133428
NameBDBM50133428
Synonyms:CHEMBL325408 | Phosphoric acid mono-((S)-2-amino-2-hexadecylcarbamoyl-ethyl) ester; TFA
TypeSmall organic molecule
Emp. Form.C19H41N2O5P
Mol. Mass.408.513
(=O)[C@@H](N)COP(O)(O)=O