Reaction Details
TargetSphingosine 1-phosphate receptor 4
LigandBDBM50133419
Substrate/Competitorn/a
Meas. Tech.ChEMBL_201444 (CHEMBL807590)
EC50 1500±n/a nM
Citation Clemens, JJDavis, MDLynch, KRMacdonald, TL Synthesis of para-alkyl aryl amide analogues of sphingosine-1-phosphate: discovery of potent S1P receptor agonists. Bioorg Med Chem Lett13:3401-4 (2003) Sphingosine 1-phosphate receptor 4
Name:Sphingosine 1-phosphate receptor 4
Type:G Protein-Coupled Receptor (GPCR)
Mol. Mass.:41647.39
Organism:Homo sapiens (Human)
Description:n/a
Residue:384
BDBM50133419
NameBDBM50133419
Synonyms:CHEMBL114031 | Phosphoric acid mono-[(S)-2-amino-2-(4-hexyl-phenylcarbamoyl)-ethyl] ester; TFA
TypeSmall organic molecule
Emp. Form.C15H25N2O5P
Mol. Mass.344.3432
SMILESCCCCCCc1ccc(NC(=O)[C@@H](N)COP(O)(O)=O)cc1