Reaction Details
TargetC-C chemokine receptor type 3
LigandBDBM50133796
Substrate/Competitorn/a
Meas. Tech.ChEMBL_41923 (CHEMBL650505)
IC50 4.7±n/a nM
Citation Gong, LHogg, JHCollier, JWilhelm, RSSoderberg, C Design and synthesis of novel CCR3 antagonists. Bioorg Med Chem Lett13:3597-600 (2003) C-C chemokine receptor type 3
Name:C-C chemokine receptor type 3
Type:Enzyme
Mol. Mass.:41053.88
Organism:Homo sapiens (Human)
Description:P51677
Residue:355
BDBM50133796
NameBDBM50133796
Synonyms:1-{(R)-2-[3-(4-Chloro-benzyl)-8-aza-bicyclo[3.2.1]oct-8-yl]-1-methyl-ethyl}-3-(3,4,5-trimethoxy-phenyl)-urea | CHEMBL121905
TypeSmall organic molecule
Emp. Form.C27H36ClN3O4
Mol. Mass.502.045
SMILESCOc1cc(NC(=O)N[C@H](C)CN2C3CCC2CC(Cc2ccc(Cl)cc2)C3)cc(OC)c1OC